*Heading
std-xpl co-simulation with dissimilar meshes
*preprint, echo=NO, history=NO, model=NO, contact=NO
** ----------------------------------------------------------------
** PART INSTANCE: PART-1-2
**
*Node
*Element, type=C3D8
*Nset, nset=ASSEMBLY_PART-1-2__PICKEDSET22
*Elset, elset=ASSEMBLY_PART-1-2__PICKEDSET22
*solidsection, elset=ASSEMBLY_PART-1-2__PICKEDSET22, material=MATERIAL-1
*surface, type=ELEMENT, name=ASSEMBLY__PICKEDSURF39
ASSEMBLY___PICKEDSURF39_S3, S3
*surface, type=ELEMENT, name=ASSEMBLY_COSIM-REGION
ASSEMBLY__COSIM-REGION_S3, S3
**
** Assembly Nsets
**
*Nset, nset=ASSEMBLY_LOAD-SET
*Nset, nset=ASSEMBLY__PICKEDSET38
**
** Assembly Elsets
**
*Elset, elset=ASSEMBLY__COSIM-REGION_S3
*Elset, elset=ASSEMBLY__PICKEDSET38
*Elset, elset=ASSEMBLY___PICKEDSURF39_S3
*amplitude, name=AMP-1
0., 0., 0.2, 1., 0.3, 0., 5., 0.
*material, name=MATERIAL-1
*density
1.,
*elastic
100000., 0.1
*Step, name=Step-1
*dynamic, explicit
, 0.3
*bulkviscosity
*cload, amplitude=AMP-1
ASSEMBLY_LOAD-SET, 2, -200.
*co-simulation, name=INT-1, program=ABAQUS, controls=INT-1_CTRLS
*co-simulationregion, type=SURFACE
ASSEMBLY_COSIM-REGION,
*co-simulationcontrols, name=INT-1_CTRLS, timeincrementation=lockstep
*restart, write, numberinterval=1, timemarks=NO
*output, field, number interval=1
*node output
U,
*output, history
*nodeoutput, nset=ASSEMBLY_LOAD-SET
U2,
*endstep