*Heading
std-xpl co-simulation with dissimilar meshes
*preprint, echo=NO, history=NO, model=NO, contact=NO
** ----------------------------------------------------------------
** PART INSTANCE: PART-1-1
**
*Node
*Element, type=C3D4
*Nset, nset=ASSEMBLY_PART-1-1__PICKEDSET22
*Elset, elset=ASSEMBLY_PART-1-1__PICKEDSET22
*solidsection, elset=ASSEMBLY_PART-1-1__PICKEDSET22, material=MATERIAL-1
*surface, type=ELEMENT, name=ASSEMBLY_COSIM-REGION
ASSEMBLY__COSIM-REGION_S4, S4
ASSEMBLY__COSIM-REGION_S3, S3
ASSEMBLY__COSIM-REGION_S2, S2
ASSEMBLY__COSIM-REGION_S1, S1
**
** Assembly Nsets
**
*Nset, nset=ASSEMBLY__PICKEDSET36
**
** Assembly Elsets
**
*Elset, elset=ASSEMBLY__COSIM-REGION_S1
*Elset, elset=ASSEMBLY__COSIM-REGION_S2
*Elset, elset=ASSEMBLY__COSIM-REGION_S3
*Elset, elset=ASSEMBLY__COSIM-REGION_S4
*Elset, elset=ASSEMBLY__PICKEDSET36
*material, name=MATERIAL-1
*density
1.,
*elastic
100000., 0.1
*Step, name=Step-1, nlgeom=YES, inc=1000000
*dynamic, alpha=-0.05, haftol=10000
0.01, 0.3,
*boundary
ASSEMBLY__PICKEDSET36, ENCASTRE
*co-simulation, name=INT-1, program=ABAQUS, controls=INT-1_CTRLS
*co-simulationregion, type=SURFACE
ASSEMBLY_COSIM-REGION,
*co-simulationcontrols, name=INT-1_CTRLS, timeincrementation=lockstep
*restart, write, frequency=0
*output, field, number interval=1
*node output
U,
*endstep