*HEADING
CLAY PLASTICITY, SHEAR TEST, CPE4R
*NODE,NSET=ALLN1
*ELEMENT,TYPE=CPE4R,ELSET=qa_test_1
*ORIENTATION,NAME=RECT
*SOLID SECTION,ELSET=qa_test_1,MATERIAL=ALLE,orient=rect
*MATERIAL,NAME=ALLE
*density
1.
*ELASTIC,TYPE=ENGINEERING CONSTANTS
200000.,342000.,342000.,.32,.32,.32,89900.,89900.
129545.5
*clay plasticity, hardening=tab
*clay hardening,type=compression
*clay hardening,type=tension
*POTENTIAL
*BOUNDARY
11,PINNED
12,PINNED
13,2
14,2
*amplitude, name=amp-1
 0.,0.,20.,1.
*STEP
*static
0.001,20.,,0.5
*BOUNDARY,amplitude=amp-1
13,1,,.1
14,1,,.1
*output,field
*element output
s,e,pe
*output,history,freq=1
*element output, elset=qa_test_1
s12,e12
*END STEP