*Heading
** Job name: Smaller-Buried-Pipe-Oct09 Model name: Model2
** Generated by: Abaqus/CAE 6.10-DEV
*Preprint, echo=NO, model=NO, history=NO, contact=NO
**
** PARTS
**
*Part, name=Part-1
*End Part
**
**
** ASSEMBLY
**
*Assembly, name=Assembly
**
*Instance, name=Part-1-1, part=Part-1
*System
*Node
*Element, type=C3D8PT
*Element, type=C3D8T
*Nset, nset=_PickedSet8, internal
*Elset, elset=_PickedSet8, internal, generate
*Nset, nset=_PickedSet9, internal
*Elset, elset=_PickedSet9, internal
*Nset, nset=_PickedSet10, internal
*Elset, elset=_PickedSet10, internal
** Section: Sand
*Solid Section, elset=_PickedSet9, material=Sand
** Section: Clay
*Solid Section, elset=_PickedSet10, material=Clay
** Section: Pipe
*Solid Section, elset=_PickedSet8, material=Pipe
*Elset,Elset=Soil,instance=Part-1-1
_PickedSet10,_PickedSet9
*End Instance
*Nset,nset=nall,generate,instance=Part-1-1
**
*Nset, nset=_PickedSet13, internal, instance=Part-1-1
*Elset, elset=_PickedSet13, internal, instance=Part-1-1
*Nset, nset=_PickedSet35, internal, instance=Part-1-1
*Elset, elset=_PickedSet35, internal, instance=Part-1-1
*Nset, nset=_PickedSet36, internal, instance=Part-1-1
*Elset, elset=_PickedSet36, internal, instance=Part-1-1
*Nset, nset=_PickedSet37, internal, instance=Part-1-1
*Elset, elset=_PickedSet37, internal, instance=Part-1-1
*Nset, nset=_PickedSet38, internal, instance=Part-1-1
*Elset, elset=_PickedSet38, internal, instance=Part-1-1
*Elset, elset=_Pipe_Inner_S4, internal, instance=Part-1-1, generate
*Surface, type=ELEMENT, name=Pipe_Inner
_Pipe_Inner_S4, S4
*Elset, elset=_Symm_S4, internal, instance=Part-1-1, generate
*Elset, elset=_Symm_S3, internal, instance=Part-1-1
*Elset, elset=_Symm_S6, internal, instance=Part-1-1
*Elset, elset=_Symm_S5, internal, instance=Part-1-1, generate
*Surface, type=ELEMENT, name=Symm
_Symm_S4, S4
_Symm_S3, S3
_Symm_S6, S6
_Symm_S5, S5
*Elset, elset=_Bottom_S4, internal, instance=Part-1-1
*Elset, elset=_Bottom_S6, internal, instance=Part-1-1
*Elset, elset=_Bottom_S5, internal, instance=Part-1-1
*Elset, elset=_Bottom_S3, internal, instance=Part-1-1
*Surface, type=ELEMENT, name=Bottom
_Bottom_S4, S4
_Bottom_S6, S6
_Bottom_S5, S5
_Bottom_S3, S3
*Elset, elset=_Pipe_Ends_S3, internal, instance=Part-1-1
*Surface, type=ELEMENT, name=Pipe_Ends
_Pipe_Ends_S3, S3
*Nset, nset=_PickedSet36_PP_, internal, instance=Part-1-1
*End Assembly
**
** MATERIALS
**
*Material, name=Clay
*elastic
1.03421e+11,0.3,-5.
1.03421e+11,0.3,-0.5
689476.,0.3,0.
*expansion
9.67e-06
*expansion,pore fluid
51.e-06,-5.
51.e-06,0.
-16.67e-06,1.
0.,4.
29.33e-06,10.
*Cap Plasticity
*Cap Hardening
**
**
*permeability,specific=9810.
1.e-11, 1. , -5.
2.e-11, 1.8, -5.
1.e-11, 1. , -0.5
2.e-11, 1.8, -0.5
1.e-08, 1. , 0.
2.e-08, 1.8, 0.
*density
1602.
*density,pore fluid
1000.
*specific heat
1381.
*specific heat,pore fluid
4186.
*conductivity
2.
*conductivity,pore fluid
0.58
*latent heat,pore fluid
334.e3,-0.5,0.
*Material, name=Pipe
*elastic
200.e9,0.3
*expansion
12.e-06
*density
7832.
*specific heat
434.
*conductivity
52.
*Material, name=Sand
*elastic
1.03421e+11,0.3,-5.
1.03421e+11,0.3,-0.5
1.03421e+07,0.3,0.
*expansion
5.6e-06
*expansion,pore fluid
51.e-06,-5.
51.e-06,0.
-16.67e-06,1.
0.,4.
29.33e-06,10.
*permeability,specific=9810.
1.e-10,1.,-5.
2.e-10,1.8,-5.
1.e-10,1.,-0.5
2.e-10,1.8,-0.5
1.e-07,1.,0.
2.e-07,1.8,0.
*density
1602.
*density,pore fluid
1000.
*specific heat
1381.
*specific heat,pore fluid
4186.
*conductivity
2.
*conductivity,pore fluid
0.58
*latent heat,pore fluid
334.e3,-0.5,0.
*initial conditions,type=temperature
nall,-5.
*initial conditions,type=ratio
nall,1.8
*initial conditions,type=pore
nall,0.
*initial conditions,type=saturation
nall,1.
*initial conditions,type=stress,geostatic
**Part-1-1.Soil,-20000.0,-7.5,0.,2.5,0.65,0.65
Part-1-1.Soil,-132435.0,-7.5,0.,2.5,0.65,0.65
*Amplitude,name=SurfTemp,definition=periodic,value=absolute
1,1.992384991e-07,0.,-5.
0.,10.
** ----------------------------------------------------------------
*Step, name=Step-0,NLGEOM=YES
*Geostatic
**Dload
**Part-1-1.Soil,BZ,-2000.
** BOUNDARY CONDITIONS
**
** Name: BC-1 Type: Displacement/Rotation
*Boundary
_PickedSet38, 1, 1
** Name: BC-2 Type: Displacement/Rotation
*Boundary
_PickedSet37, 2, 2
** Name: BC-3 Type: Displacement/Rotation
*Boundary
_PickedSet13, 3, 3
** Name: BC-4 Type: Displacement/Rotation
*Boundary
_PickedSet35, 2, 2
** Name: BC-5 Type: Pore pressure
*Boundary
_PickedSet36_PP_, 8, 8
_PickedSet36_PP_, 11, 11, -5.
** OUTPUT REQUESTS
**
*Restart, write, overlay
**
** FIELD OUTPUT: F-Output-1
**
*Output, field, variable=PRESELECT
**
** HISTORY OUTPUT: H-Output-1
**
*Output, history, variable=PRESELECT
**Controls,parameter=field,field=pore fluid pressure
**,,1.e-12
*End Step
**
** STEP: Step-1
**
*Step, name=Step-1, nlgeom=YES, unsymm=YES, INC=10000
*Soils, consolidation, end=PERIOD, utol=1.e9, deltmx=2.,creep=none
**To run the analysis for a one year period,
**uncommment the next line and comment
**out the line following that
**2.,31.536e6,1.,86400.
**
*Dload
**Part-1-1._PickedSet8,BZ,-13000.
Part-1-1._PickedSet8,BZ,-77028.
** BOUNDARY CONDITIONS
**
** Name: BC-1 Type: Displacement/Rotation
*Boundary
_PickedSet38, 1, 1
** Name: BC-2 Type: Displacement/Rotation
*Boundary
_PickedSet37, 2, 2
** Name: BC-3 Type: Displacement/Rotation
*Boundary
_PickedSet13, 3, 3
** Name: BC-4 Type: Displacement/Rotation
*Boundary
_PickedSet35, 2, 2
** Name: BC-5 Type: Pore pressure
*Boundary
_PickedSet36_PP_, 8, 8
*Boundary,Amplitude=SurfTemp
_PickedSet36_PP_, 11, 11, 1.
*Sfilm
Pipe_Inner,F,20.,750.
**
** OUTPUT REQUESTS
**
*Restart, write, overlay
**
** FIELD OUTPUT: F-Output-1
**
*Output, field, freq=20
*Node Output
NT,
RVF,
POR,
U,
*Element Output
FLVEL,
HFL,
**
** HISTORY OUTPUT: H-Output-1
**
*Output, history, variable=PRESELECT
*Controls,parameter=field,field=pore fluid pressure
,,1.e-12
*End Step