*HEADING
 SQUARE PLATE - ELASTIC BUCKLING  ( LOAD INCR ) - S3R  4 X 4
*NODE,NSET=N101
*NODE,NSET=N105
*NODE
*NGEN,NSET=YSYM
*NGEN,NSET=XSYM
*NGEN,NSET=YEDG
*NGEN,NSET=XEDG
*NFILL
XSYM,XEDG,4,1
*ELEMENT,TYPE=S3R,ELSET=ONE
*ELGEN,ELSET=EALL
*SHELL SECTION,MATERIAL=A1,ELSET=EALL
0.01,3
*MATERIAL,NAME=A1
*ELASTIC
1.E8,0.3
*BOUNDARY
YSYM,YSYMM
XSYM,XSYMM
YEDG,3
YEDG,5
XEDG,3
XEDG,4
XEDG,6
*STEP,NLGEOM,INC=20
*STATIC
 .1,1. , , .1
*CLOAD
105,1,-12.5
205,1,-25.
305,1,-25.
405,1,-25.
505,1,-12.5
*PRINT,RESIDUAL=NO
*EL PRINT,ELSET=ONE ,SUMMARY=NO,POSITION=CENTROID
S,
*EL FILE,ELSET=ONE ,POSITION=CENTROID
S,
*NODE PRINT,SUMMARY=NO
U,CF1
*NODE FILE,NSET=N101
U,
*NODE FILE,NSET=N105
CF,
*END STEP