*Heading
Beam problem
***Compare with std-xpl cosimulation jobs beam_dyntodyn_lockstep_std.inp
***and beam_dyntodyn_lockstep_xpl.inp
*preprint, echo=NO, history=NO, model=NO, contact=NO
** ----------------------------------------------------------------
** PART INSTANCE: PART-1-1
**
*Node
*Element, type=B31
*Nset, nset=ASSEMBLY_PART-1-1__PICKEDSET2
*Nset, nset=ASSEMBLY_PART-1-1__PICKEDSET4
*Elset, elset=ASSEMBLY_PART-1-1__PICKEDSET2
*Elset, elset=ASSEMBLY_PART-1-1__PICKEDSET4
*beamsection, elset=ASSEMBLY_PART-1-1__PICKEDSET2, temperature=GRADIENTS, material=MATERIAL-1, section=RECT
**
** Assembly Nsets
**
*Nset, nset=ASSEMBLY_SET-1
*Nset, nset=ASSEMBLY_SET-2
*Nset, nset=ASSEMBLY_SET-3
*amplitude, name=RAMP1
0., 0.,0.25,1.0,0.5,0, 1., 0.
*material, name=MATERIAL-1
*density
1.,
*elastic
100000., 0.1
*material, name=MATERIAL-2
*density
1E-08,
*elastic
100000., 0.1
*Step, name=Step-1
*dynamic, explicit
, 5.
*bulkviscosity
*boundary
ASSEMBLY_SET-1, 1, 1
ASSEMBLY_SET-1, 2, 2
ASSEMBLY_SET-1, 3, 3
ASSEMBLY_SET-1, 4, 4
ASSEMBLY_SET-1, 5, 5
ASSEMBLY_SET-1, 6, 6
*cload, amplitude=RAMP1
ASSEMBLY_SET-2, 1, 0.
ASSEMBLY_SET-2, 2, -200.
*restart, write, numberinterval=1, timemarks=NO
*output, field
*node output
U,
*output, history
*nodeoutput, nset=ASSEMBLY_SET-3
U1, U2, U3, UR1, UR2, UR3
*nodeoutput, nset=ASSEMBLY_SET-2
U1, U2, U3, UR1, UR2, UR3
*output, history, variable=PRESELECT
*endstep