*Heading
std-xpl co-simulation with B31 elements
*preprint, echo=NO, history=NO, model=NO, contact=NO
** ----------------------------------------------------------------
** PART INSTANCE: PART-1-1
**
*Node
*Element, type=B31
*Nset, nset=ASSEMBLY_PART-1-1__PICKEDSET4
*Nset, nset=ASSEMBLY_PART-1-1__PICKEDSET7
*Nset, nset=ASSEMBLY_PART-1-1__PICKEDSET8
*Elset, elset=ASSEMBLY_PART-1-1__PICKEDSET4
*Elset, elset=ASSEMBLY_PART-1-1__PICKEDSET7
*Elset, elset=ASSEMBLY_PART-1-1__PICKEDSET8
*beamsection, elset=ASSEMBLY_PART-1-1__PICKEDSET8, temperature=GRADIENTS, material=MATERIAL-2, section=RECT
*beamsection, elset=ASSEMBLY_PART-1-1__PICKEDSET7, temperature=GRADIENTS, material=MATERIAL-1, section=RECT
**
** Assembly Nsets
**
*Nset, nset=ASSEMBLY_SET-1
*Nset, nset=ASSEMBLY_SET-2
*amplitude, name=RAMP1
0., 0., 0.25, 1.,0.5,0.,1,0.
**0., 0., 1., 1.
*material, name=MATERIAL-1
*density
1.,
*elastic
100000., 0.1
*material, name=MATERIAL-2
*density
1.0,
*elastic
100000., 0.1
*nset,nset=node1
*surface,type=node, name=CNSURF
*Step, name=Step-1
*dynamic, explicit
, 1.
*bulkviscosity
*co-simulation controls, name=ctrl, time incrementation=lockstep
*co-simulation, name=exp_std, program=abaqus, controls=ctrl
*co-simulation region, type=surface
CNSURF,
*cload, amplitude=RAMP1
ASSEMBLY_SET-2, 2, -200.0
*output, field, number interval=10
*node output
U,
*output, history
*nodeoutput, nset=ASSEMBLY_SET-1
U1, U2, U3, UR1, UR2, UR3
*node output, nset=Assembly_set-2
U1, U2, U3, UR1, UR2, UR3
*endstep