*Heading
std-xpl co-simulation with B21 elements
*preprint, echo=NO, history=NO, model=NO, contact=NO
** ----------------------------------------------------------------
** PART INSTANCE: PART-1-1
**
*Node
*Element, type=B21
*Nset, nset=ASSEMBLY_PART-1-1__PICKEDSET2
*Nset, nset=ASSEMBLY_PART-1-1__PICKEDSET4
*Elset, elset=ASSEMBLY_PART-1-1__PICKEDSET2
*Elset, elset=ASSEMBLY_PART-1-1__PICKEDSET4
*beamsection, elset=ASSEMBLY_PART-1-1__PICKEDSET2, temperature=GRADIENTS, material=MATERIAL-1, section=RECT
**
** Assembly Nsets
**
*Nset, nset=ASSEMBLY_SET-1
*Nset, nset=ASSEMBLY_SET-2
*amplitude, name=RAMP1
0., 0., 1., 1.
*material, name=MATERIAL-1
*density
1.,
*elastic
100000., 0.1
*material, name=MATERIAL-2
*density
1E-08,
*elastic
100000., 0.1
*nset,nset=node11
*nset, nset=cn
*surface,name=CNSURF,type=node
CN,
*Step, name=Step-1, nlgeom=YES,inc=100000
*dynamic, alpha=0.0, haftol=100
0.01, 5.,,0.025
*co-simulation controls, name=ctrl, time incrementation=subcycle
*co-simulation, name=exp_std, program=abaqus, controls=ctrl
*co-simulation region, type=surface
CNSURF,
*boundary
ASSEMBLY_SET-1, 1, 1
ASSEMBLY_SET-1, 2, 2
ASSEMBLY_SET-1, 3, 3
ASSEMBLY_SET-1, 4, 4
ASSEMBLY_SET-1, 5, 5
ASSEMBLY_SET-1, 6, 6
*output, field, number interval=10, time marks=no
*node output
U,V,
*output, history
*node output, nset=node11
U1,U2,U3,UR1,UR2,UR3,
VR1,VR2,VR3,
*endstep