*HEADING
 BARREL VAULT  ( 2 X 2 MESH STRI65)
*PREPRINT,ECHO=YES,MODEL=NO,HISTORY=NO
*NODE,SYSTEM=C,NSET=CORNER
*NGEN,LINE=C,NSET=WALL
*NGEN,LINE=C,NSET=SYMM
*NFILL
WALL,SYMM,4,2
*NGEN,NSET=APEX
*ELEMENT,TYPE=STRI65,ELSET=ROOF1
*ELGEN,ELSET=ROOF
*ELSET,ELSET=FEW
*MATERIAL,NAME=STEEL
*ELASTIC
 3.E6,
*BOUNDARY
 APEX,YSYMM
 SYMM,ZSYMM
 WALL,1,2
*SHELL SECTION,MATERIAL=STEEL,ELSET=ROOF
 3.0,3
*STEP
 SELF-WEIGHT
*STATIC
*DLOAD
 ROOF,BX,-0.20833
*EL PRINT,ELSET=FEW
*NODE FILE,NSET=CORNER
U,
RF,
*EL FILE,ELSET=ROOF1
S,SINV
SF,
*END STEP