*HEADING
 BARREL VAULT  (4 X 4 SC6R)
*PREPRINT,ECHO=YES,MODEL=NO,HISTORY=NO
*NODE,SYSTEM=C,NSET=CORNER
*NGEN,LINE=C,NSET=WALL
*NGEN,LINE=C,NSET=SYMM
*NFILL
 WALL,SYMM,4,10
*NGEN,NSET=APEX
*ELEMENT,TYPE=SC6R,ELSET=ROOF1
*ELGEN,ELSET=ROOF
*MATERIAL,NAME=STEEL
*ELASTIC
 3.E6,
*SHELL SECTION ,MATERIAL=STEEL,ELSET=ROOF,POISSON=ELASTIC
 3.,3
*BOUNDARY
 APEX,YSYMM
 SYMM,ZSYMM
 WALL,1,2
*STEP
 SELF WEIGHT
*STATIC
*DLOAD
 ROOF,BX,-0.20833
*ENERGY PRINT
*EL PRINT,FREQ=0
*EL FILE,ELSET=ROOF1
 S,SINV
 SF,
 ENER,
 E,
*NODE FILE,NSET=CORNER
 U,
 RF,
*ENERGY FILE
*END STEP