*HEADING
 BARREL VAULT  ( 9 X 9 MESH S8R)            K        1-1-1-BC
*PREPRINT,ECHO=YES,MODEL=NO,HISTORY=NO
*NODE,SYSTEM=C,NSET=CORNER
*NGEN,LINE=C,NSET=WALL
*NGEN,LINE=C,NSET=SYMM
*NFILL
WALL,SYMM,18,1
*NGEN,NSET=APEX
*ELEMENT,TYPE=S8R,ELSET=ROOF1
*ELGEN,ELSET=ROOF
*ELSET,ELSET=FEW
*MATERIAL,NAME=METAL
*ELASTIC
 3.E6,
*BOUNDARY
 APEX,YSYMM
 SYMM,ZSYMM
 WALL,1,2
 WALL,6
*SHELL SECTION,MATERIAL=METAL,ELSET=ROOF
 3.0,3
*STEP
 SELF-WEIGHT
*STATIC
*DLOAD
 ROOF,BX,-0.20833
*ENERGY PRINT
*EL PRINT,ELSET=FEW
S,
E,
*EL FILE,ELSET=ROOF1
S,
E,
*NODE FILE,NSET=CORNER
U,
RF,
*END STEP