*HEADING
  BARREL VAULT 4 X 4 MESH S8R5
*PREPRINT,ECHO=YES,MODEL=NO,HISTORY=NO
*NODE,SYSTEM=C,NSET=CORNER
*NGEN,LINE=C,NSET=WALL
*NGEN,LINE=C,NSET=SYMM
*NFILL
WALL,SYMM,8,1
*NSET,NSET=APEX,GENERATE
*ELEMENT,TYPE=S8R5,ELSET=ROOF1
*ELGEN,ELSET=ROOF
*ELSET,ELSET=FEW
*MATERIAL,NAME=STEEL
*ELASTIC
 3.E6,
*BOUNDARY
 APEX,YSYMM
 SYMM,ZSYMM
 WALL,1,2
*SHELL SECTION ,ELSET=ROOF,MATERIAL=STEEL
 3.0,3
*RESTART,WRITE,FREQUENCY=999
*STEP
 SELF-WEIGHT
*STATIC
*DLOAD
 ROOF,BX,-0.20833
*ENERGY PRINT
*EL PRINT,ELSET=FEW
S,
SINV,
SF,
E,
ENER,
*EL PRINT,POSITION=AVERAGED AT NODES
S,E
*EL FILE,ELSET=ROOF1
S,
SINV,
E,
*EL FILE,POSITION=AVERAGED AT NODES,ELSET=ROOF1
S,
E,
*NODE FILE,NSET=CORNER
U,
CF,
*ENERGY FILE
*END STEP