*HEADING
 BARREL VAULT  ( 20 X 20 MESH ,  S8R5 )
*PREPRINT,ECHO=YES,MODEL=NO,HISTORY=NO
*NODE,SYSTEM=C,NSET=CORNER
*NGEN,LINE=C,NSET=WALL
*NGEN,LINE=C,NSET=SYMM
*NFILL
WALL,SYMM,40,1
*NGEN,NSET=APEX
*ELEMENT,TYPE=S8R5,ELSET=ROOF1
*ELGEN,ELSET=ROOF
*MATERIAL,NAME=STEEL
*ELASTIC
 3.E6,
*BOUNDARY
 APEX,YSYMM
 SYMM,ZSYMM
 WALL,1,2
*SHELL SECTION,MATERIAL=STEEL,ELSET=ROOF
 3.0,3
*STEP
 SELF-WEIGHT
*STATIC
*DLOAD
 ROOF,BX,-0.20833
*ENERGY PRINT
*ENERGY FILE
*EL PRINT,FREQUENCY=0
*EL FILE,ELSET=ROOF1
S,
E,
*NODE PRINT,NSET=CORNER
U,
RF,
*NODE FILE,NSET=CORNER
U,
RF,
*END STEP