*HEADING
 BARREL VAULT  ( 4 X 4 MESH , S4R )
*PREPRINT,ECHO=YES,MODEL=NO,HISTORY=NO
*NODE,SYSTEM=C,NSET=CORNER
*NGEN,LINE=C,NSET=WALL
*NGEN,LINE=C,NSET=SYMM
*NFILL
WALL,SYMM,4,2
*NGEN,NSET=APEX
*NSET,NSET=MID
*NSET,NSET=QA_TEST_MID
*ELEMENT,TYPE=S4R,ELSET=ROOF1
*ELGEN,ELSET=ROOF
*ELSET,ELSET=FEW
*MATERIAL,NAME=STEEL
*ELASTIC
 3.E6, 0.
*DENSITY
 8.,
*BOUNDARY
 APEX,YSYMM
 SYMM,ZSYMM
 WALL,1,2
*SECTION CONTROLS, NAME=HGLASS, HOURGLASS=ENHANCED
*SHELL SECTION,ELSET=ROOF ,MATERIAL=STEEL, CONTROLS=HGLASS
 3.0
*AMPLITUDE, NAME=RAMP,DEFINITION=SMOOTH STEP
 0.0, 0.0,150, 1.0
*STEP,NLGEOM=NO
 SELF-WEIGHT
*DYNAMIC, EXPLICIT
  ,225
*DLOAD, AMPLITUDE=RAMP
 ROOF,BX,-0.20833
*OUTPUT,HISTORY,FREQ=5
*NODE OUTPUT,NSET=MID
 U,
*ENERGY OUTPUT
ALLAE,ALLCD,ALLKE,ALLIE,ALLWK,ETOTAL,ALLSE
*OUTPUT, FIELD, NUMBER INTERVAL=5
*NODE OUTPUT,NSET=QA_TEST_MID
 U,
*FILE OUTPUT,NUMBER INTERVAL=5
*NODE FILE,NSET=QA_TEST_MID
U
*END STEP