*HEADING
 BARREL VAULT  ( 18 X 18 MESH , S4R)
*PREPRINT,ECHO=YES,MODEL=NO,HISTORY=NO
*NODE,SYSTEM=C,NSET=CORNER
*NGEN,LINE=C,NSET=WALL
*NGEN,LINE=C,NSET=SYMM
*NFILL
WALL,SYMM,18,1
*NGEN,NSET=APEX
*ELEMENT,TYPE=S4R,ELSET=ROOF1
*ELGEN,ELSET=ROOF
*ELSET,ELSET=FEW
*MATERIAL,NAME=STEEL
*ELASTIC
 3.E6,
*BOUNDARY
 APEX,YSYMM
 SYMM,ZSYMM
 WALL,1,2
*SHELL SECTION,MATERIAL=STEEL,ELSET=ROOF
 3.0,3
*STEP
 SELF-WEIGHT
*STATIC
*DLOAD
 ROOF,BX,-0.20833
*ENERGY PRINT
*EL PRINT,FREQUENCY=0
*EL FILE,ELSET=ROOF1
S,
*NODE FILE,NSET=CORNER
U,
RF,
*EL FILE
*END STEP