*HEADING
 BARREL VAULT  ( 8 X 8 MESH , S3RS)
*PREPRINT,ECHO=YES,MODEL=NO,HISTORY=NO
*NODE,SYSTEM=C,NSET=CORNER
*NGEN,LINE=C,NSET=WALL
*NGEN,LINE=C,NSET=SYMM
*NFILL
WALL,SYMM,8,1
*NGEN,NSET=APEX
*ELEMENT,TYPE=S3RS,ELSET=ROOF1
*ELGEN,ELSET=ROOF
*ELSET,ELSET=FEW
*MATERIAL,NAME=STEEL
*ELASTIC
 3.E6,
*DENSITY
8.
*BOUNDARY
 APEX,YSYMM
 SYMM,ZSYMM
 WALL,1,2
*SHELL SECTION,ELSET=ROOF,MATERIAL=STEEL
 3.0,3
*AMPLITUDE,NAME=RAMP,DEFINITION=SMOOTH STEP
 0.0, 0.0,150, 1.0
*STEP,NLGEOM=NO
 SELF-WEIGHT
*DYNAMIC, EXPLICIT
  ,225
*DLOAD,AMP=RAMP
 ROOF,BX,-0.20833
*OUTPUT, FIELD, VAR=PRESELECT, NUMBER INTERVAL=5
**
** Output requests for qa testing
**
*NSET,NSET=QA_TEST
CORNER,
*OUTPUT,FIELD,NUM=1
*NODE OUTPUT,NSET=QA_TEST
U,
*OUTPUT,HISTORY,VAR=PRESELECT,TIME INTERVAL=56.25
*FILE OUTPUT,NUM=1
*NODE FILE,NSET=CORNER
U,
*ENERGY FILE
*END STEP