*Heading
** Job name: alfan_std_conn2d
*Preprint, echo=NO, model=No, history=NO, contact=NO
**
*Node
*Node
*Ngen,nset=bot
*Node
*Ngen,nset=top
*Element, type=CPE4I
*Elset, elset=_PickedSet2, generate
** Section: Section-1
*Solid Section, elset=_PickedSet2, material=Material-1, orientation=Ori-3
20.0,
*Orientation, name=Ori-3
**
*Nset, nset=_PickedSet4
*Nset, nset=_PickedSet5
*element,type=conn2d2,elset=connector
**
**
*element,type=conn2d2,elset=connector-2
*Elgen,elset=connector-2
*nset,nset=rot,gen
*Connector Section, elset=connector, behavior=ConnProp-1,controls=viscosity
CARTESIAN,
*Connector Section, elset=connector-2, behavior=ConnProp-1,controls=viscosity
CARTESIAN,
*Section control, name=viscosity, viscosity=0.5d-3,max degradation=0.87
**
*Material, name=Material-1
*Density
2.0388e-6,
*Elastic, type=ENGINEERING CONSTANTS
1.15e+5, 8.5e+03, 8.5e+03,    0.29,    0.29,     0.3, 4.5e+03, 3.3e+03
4.5e+03,
*Connector Behavior, name=ConnProp-1
*Connector Elasticity,component=2
*Connector Elasticity,component=1
*Connector Damage Initiation, Criterion=force, component=2
*Connector Damage Evolution, soft=tabular, type=motion, affected components
**
*elset,elset=conn
*elset,elset=surf-1,gen
*surface,type=element,name=surf-1
surf-1,s3
*elset,elset=surf-2,gen
*surface,type=element,name=surf-2
surf-2,s1
*surface,type=node,name=node_bot
bot,
*surface,type=node,name=node_top
top,
*elset,elset=elem_bot,gen
*elset,elset=elem_top,gen
*surface,type=element,name=elem_bot
elem_bot,s3
*surface,type=element,name=elem_top
elem_top,s1
*tie,name=tie
node_bot,elem_bot
node_top,elem_top
*Surface Interaction, name=IntProp-2
1.,
*Surface Behavior, pressure-overclosure=HARD
**
** INTERACTIONS
**
** Interaction: Int-1
*Contact Pair, interaction=IntProp-2
Surf-1, Surf-2
** MATERIALS
** ----------------------------------------------------------------
**
** STEP: Step-1
**
*Step, name=Step-1, nlgeom=YES, inc=5000,Convert Sdi=No
*Static,stabilize,allsdtol
0.01, 1., 1e-07, 0.01
*Controls, parameter=field
0.001,
**
** BOUNDARY CONDITIONS
**
** Name: BC-1 Type: Displacement/Rotation
*Boundary
_PickedSet4, 1, 1
_PickedSet4, 2, 2, 20
** Name: BC-2 Type: Displacement/Rotation
*Boundary
_PickedSet5, 1, 1
_PickedSet5, 2, 2, -20
Rot,6,6,0
**
** OUTPUT REQUESTS
**
*Restart, write, frequency=0
**
** FIELD OUTPUT: F-Output-1
**
*Output, field, freq=25
*node output
u,
*element output
s,
**
** HISTORY OUTPUT: H-Output-1
**
*Output, history, freq=10
*Node output, nset=_PickedSet4
u2,rf2
*End Step