*HEADING
**
*PREPRINT, ECHO=NO, MODEL=NO, HISTORY=NO
*NODE,NSET=BEAMS,SYSTEM=C
********************************
*NODE,NSET=STIFFNER
*****
*NGEN,NSET=BEAMS,LINE=C
*NSET,NSET=OUT
*NSET,NSET=P_OUT
****************************
*NODE,NSET=INNER,SYSTEM=C
*NGEN,NSET=INNER,LINE=C
*****************************
*NODE,NSET=OUTER,SYSTEM=C
*NGEN,NSET=OUTER,LINE=C
*****************************
*NFILL,NSET=ACOUSTIC
INNER,OUTER,20,100
**********************************
*ELEMENT,TYPE=SAX1,ELSET=BEAMS
*ELGEN,ELSET=BEAMS
*ELEMENT,TYPE=SAX1,ELSET=STIFFNER
******************
*ELEMENT, TYPE=ACAX4,ELSET=ACOUSTIC
*ELGEN, ELSET=ACOUSTIC
****************************
*ELGEN,ELSET=SLAVE
*SURFACE,TYPE=ELEMENT,NAME=SLAVE
SLAVE,S1
*SURFACE,TYPE=ELEMENT,NAME=MASTER
BEAMS,SPOS
*TIE,NAME=COUPLING,adjust=no,position tolerance=1.0
slave,master
************************************
*MATERIAL,NAME=WATER
*DENSITY
1000.0,
*ACOUSTIC MEDIUM,BULK MODULUS
*ACOUSTIC MEDIUM,VOLUMETRICDRAG
*SOLID SECTION,MATERIAL=WATER,ELSET=ACOUSTIC
0.1,
*******************
*SHELL SECTION,MATERIAL=MAT1,ELSET=BEAMS
0.1
*SHELL SECTION,MATERIAL=MAT1,ELSET=STIFFNER
0.1
*MATERIAL,NAME=MAT1
*ELASTIC
207E9,0.3
*DENSITY
7800
*************************
*AMPLITUDE,DEFINITION=PERIODIC,NAME=SINE
1,628.3185,0,0.0
0.0,1.0
*ELSET,ELSET=OUTER,GENERATE
*SURFACE,NAME=OUTER
OUTER,S3
**********************
*STEP,INC=1000,NLGEOM=YES
*DYNAMIC,ALPHA=0.0
2.5e-5,0.003
*IMPEDANCE,NONREFLECTING=SPHE
OUTER,I3,8.0
*BOUNDARY,AMP=SINE,TYPE=ACCEL
75,2,2,1.0E4
*BOUNDARY
25001,1,1,0.0
25071,1,1,0.0
25001,6,6,0.0
25071,6,6,0.0
55,1,1,0.0
55,6,6,0.0
*OUTPUT,FIELD,FREQ=50
*NODE OUTPUT,NSET=BEAMS
U,
*NODE OUTPUT,NSET=ACOUSTIC
POR
*OUTPUT,HISTORY,FREQ=50
*NODE OUTPUT,NSET=out
U,V,A
*NODE OUTPUT,NSET=P_out
POR,
*END STEP
*STEP,INC=1000,NLGEOM=YES
*DYNAMIC,ALPHA=0.0
2.5e-5,0.003
*BOUNDARY,AMP=SINE,TYPE=ACCEL
75,2,2,1.0E4
*IMPEDANCE,NONREF=circ,OP=NEW
*SIMPEDANCE,NONREFLECTING=spherical
OUTER,8.0
*OUTPUT,FIELD,FREQ=50
*NODE OUTPUT,NSET=ACOUSTIC
POR
*OUTPUT,HISTORY,FREQ=50
*NODE OUTPUT,NSET=out
U,V,A
*NODE OUTPUT,NSET=P_out
POR,
*END STEP