*HEADING
**
*PREPRINT, ECHO=NO, MODEL=NO, HISTORY=NO
*NODE,NSET=BEAMS,SYSTEM=C
********************************
*NODE,NSET=STIFFNER
*****
*NGEN,NSET=BEAMS,LINE=C
*NSET,NSET=OUT
*NSET,NSET=P_OUT
*NSET,NSET=QA_TEST
P_OUT,
****************************
*NODE,NSET=INNER,SYSTEM=C
*NGEN,NSET=INNER,LINE=C
*****************************
*NODE,NSET=OUTER,SYSTEM=C
*NGEN,NSET=OUTER,LINE=C
*****************************
*NFILL,NSET=ACOUSTIC
INNER,OUTER,20,100
**********************************
*ELEMENT,TYPE=B21,ELSET=BEAMS
*ELGEN,ELSET=BEAMS
*ELEMENT,TYPE=B21,ELSET=STIFFNER
******************
*ELEMENT, TYPE=AC2D4R,ELSET=ACOUSTIC
*ELGEN, ELSET=ACOUSTIC
****************************
*ELGEN,ELSET=SLAVE
*SURFACE,TYPE=ELEMENT,NAME=SLAVE
SLAVE,S1
*SURFACE,TYPE=ELEMENT,NAME=MASTER
BEAMS,SPOS
*TIE,NAME=COUPLING
slave,master
************************************
*MATERIAL,NAME=WATER
*DENSITY
1000.0,
*ACOUSTIC MEDIUM,BULK MODULUS
*ACOUSTIC MEDIUM,VOLUMETRICDRAG
*SOLID SECTION,MATERIAL=WATER,ELSET=ACOUSTIC
0.1,
*******************
*BEAM SECTION,MATERIAL=MAT1,ELSET=BEAMS,SECTION=RECT
0.1,0.1
*BEAM SECTION,MATERIAL=MAT1,ELSET=STIFFNER,SECTION=RECT
0.1,0.1
*MATERIAL,NAME=MAT1
*ELASTIC
207E9,0.3
*DENSITY
7800
*************************
*AMPLITUDE,DEFINITION=PERIODIC,NAME=SINE
1,628.3185,0,0.0
0.0,1.0
*ELSET,ELSET=OUTER,GENERATE
*SURFACE,NAME=OUTER
OUTER,S3
**********************
*STEP
*DYNAMIC,EXPLICIT,DIRECT
2.5e-5,0.003
*IMPEDANCE,NONREFLECTING=CIRCULAR
OUTER,I3,8.0
*BOUNDARY,AMP=SINE,TYPE=ACCEL
75,2,2,1.0E4
*BOUNDARY
25001,1,1,0.0
25071,1,1,0.0
25001,6,6,0.0
25071,6,6,0.0
55,1,1,0.0
55,6,6,0.0
*OUTPUT,FIELD,NUMBER=1
*NODE OUTPUT,NSET=BEAMS
U
*NODE OUTPUT,NSET=ACOUSTIC
POR
*NODE OUTPUT,NSET=QA_TEST
POR
*OUTPUT,HISTORY,freq=1
*NODE OUTPUT,NSET=out
U,V,A
*NODE OUTPUT,NSET=P_out
POR,
*END STEP